ld returned 1 exit status collect2 exe

by ld returned 1 exit status collect2 exe

Référence indéfinie à main - collect2: ld a renvoyé 1 ...

ld returned 1 exit status collect2 exe

Référence indéfinie à main - collect2: ld a renvoyé 1 ...

Référence indéfinie à main - collect2: ld a renvoyé 1 ...

Traduci · Bon je suis entrain de tout reprendre a zero. Sur la page de Domoticz il est mentionné ceci: [code Domoticz Source Warning: building and running domoticz from the latest sources may break your install of Domoticz - proceed with caution!! Traduci · You are viewing a single comment. View All 1. Yuvikiit (2) Traduci · From: Shakeel Ahmed, Dr. Date: Tue, 23 Dec 2014 11:20:13 +0500 Dear FLUKA experts I am trying to link DPMJET through flutil/ldpmqmd script but I am getting /usr/bin/ld: cannot find crt1.o: No such file or directory C:\Users\Desktop\collect2.exe [Error] ld returned 1 exit status Come risolvo ? Siccome parto da zero, potete indicarmi siti da consultare per imparare gradualmente? Grazie 1000 in anticipo a chi vorrà rispondere ! Peter problema di compilazione:collect2: ld returned 1 exit status. di Gemock » 11/08/04 04:39 . Salve, Il problema che ho avuto nasche dal fatto che volevo installare gtk 2.4.4 e per poterlo fare ho dovuto installare (o meglio provare a farlo) alcune altre librerie (atk 1.6.1, glib 2.4.5, pkgconfig lo avevo gia' e pango 1.4.1). ... ` imp HidD [email protected]' matlab mex使用错误:undefined reference to `filter()‘collect2 ... C/C++ - Errore compilazione/esecuzione programma in ... libc | LABS

[Error] ld returned 1 exit status - Forum C/C++

[Error] ld returned 1 exit status - Forum C/C++

Traduci · 2016-12-08 · MakeNSIS 2.50 Compile on CentOS7 NSIS Discussion The free customizable Winamp media player that plays mp3 + other audio files, syncs your iPod, subscribes to Podcasts and more. gcc -pthread -c sortieren. c gcc sortieren. o sortieren. o: In function ` main ': sortieren. c:(. text + 0xd7): undefined reference to ` ptread_create ' collect2: ld returned 1 exit status make: *** [sortieren] Fehler 1. Naturalmente ho cercato su google ma ogni “soluzione” che ho trovato non ha funzionato per me. # gcc gtk-hello.c -I/usr/include/gtk -lgtk -lgdk -lglib -lXext -lX11 -lm /usr/i586-pc-linux-gnulibc1/bin/ld: cannot open -lXext: No such file or directory collect2: ld returned 1 exit status. specificare quali librerie dinamiche utilizzare non è a volte sufficiente, occorre anche dire al linker dove cercarle.

C/C++ - collect2: error: ld returned 1 exit status con ...

C/C++ - collect2: error: ld returned 1 exit status con ...

Traduci · Re: GCC Error! ld returned 1 exit status Try using the command g++ instead of gcc. Using -executeMethod and BuildPipeline. js [1/4] 🔍 Resolving packages. error: command. $ cd client && …. If we remove the echo command from the script we should see the exit code of the touch command. js: 1199: 26) at Object. Forum - C/C++ - collect2: error: ld returned 1 exit status con librerie e linker di IBM ILOG CPLEX. pppppaolo (Normal User) Newbie Messaggi: 4 Iscritto: 22/08/2017 Postato alle 11:18 Martedì, 22/08/2017. Ragazzi sto compilando su eclipse cdt un programma in c++ nel quale devo linkare le librerie di ILOG CPLEX . int status = 0; ^ D:\projects\_GitHub\CorsairKeyboardSpectrograph\CorsairKeyboardVisualizer.cpp: In function 'bool ... collect2.exe: error: ld returned 1 exit status Process terminated with status 1 (0 minute(s), 1 second(s)) 8 error(s), 10 warning(s) (0 minute(s), 1 second(s))

Problema dev-c++ [Error] ld returned 1 exit status ...

Problema dev-c++ [Error] ld returned 1 exit status ...

int status = 0; ^ D:\projects\_GitHub\CorsairKeyboardSpectrograph\CorsairKeyboardVisualizer.cpp: In function 'bool ... collect2.exe: error: ld returned 1 exit status Process terminated with status 1 (0 minute(s), 1 second(s)) 8 error(s), 10 warning(s) (0 minute(s), 1 second(s)) Traduci · 授予每个自然周发布1篇到3篇原创it博文的用户。本勋章将于次周周三上午根据用户上周的博文发布情况由系统自动颁发。 2017-12-09 · collect2.exe: error: ld returned 1 exit status 19:04:35 Build Finished (took 3s.128ms) poi, quando vado ad eseguire mi esce: Launching Netflix.exe has encounterend a problem. Program file does not exist Non riesco a capire qual'è il problema. Qualcuno può aiutarmi? Grazie

Problema dev-c++ [Error] ld returned 1 exit status ...

Problema dev-c++ [Error] ld returned 1 exit status ...

Traduci · /usr/bin/ld: cannot find -lgcc_s collect2: ld returned 1 exit status. This because gcc tries to link statically libgcc too – but using the wrong file: libgcc_s.a. To link statically libgcc you have to add the -static-libgcc flag # gcc test.c -o test -Wl,-Bstatic -lcrypto -static-libgcc C Program Files (x86)\Dev-Cpp\MinGW64\x86_64-w64-mingw32\bin\ld.exe final link failed: No space left on device C Users\bruno\Desktop\Nuova cartella (5)\collect2.exe [Error] ld returned 1 exit status Ho letto di svuotare la cartella Temp, l'ho fatto ma continua a dare questo stesso errore Traduci · Thank you, i found problems with some functions from ros, like ros::Time:now(). I don’t know if it’s a problem of husarion cloud or mine. Now i’m trying work offline with hFramework,h an ros directly and looks well. errore compilazione Dev C++, Forum Programmazione: commenti, esempi e tutorial dalla community di HTML.it. Traduci · /usr/bin/ld: cannot find -lgcc_s collect2: ld returned 1 exit status. This because gcc tries to link statically libgcc too – but using the wrong file: libgcc_s.a. To link statically libgcc you have to add the -static-libgcc flag # gcc test.c -o test -Wl,-Bstatic -lcrypto -static-libgcc 2017-02-01 · Credo che ld.exe interpreti -lz non come una opzione ma come un file che ovviamente non trova. Clicca per allargare... si questo l'avevo già capito, il fatto è che anche se ho scaricato il file in questione, ci sarebbero un percorso per preciso in cui metterlo che io non so Errore di making | Reboot.msGiochi di luce con Arduino – nono gioco - Mauro Alfieri ...Repl.it - Why does this error occur in Cun aiuto per c++ :)!!!!!!!!!!!!!!!!!!!!!!!? | Yahoo Answers collect2.exe: error: ld returned 1 exit status exit status 1 Errore durante la compilazione per la scheda Arduino/Genuino Uno. Da quello che ho intuito entrambe le librerie utilizzano una stessa variabile giusto? Ho provato ad aprire il codice di entrambe le librerie ma onestamente non saprei dove mettere le mani. Hai qualche idea/suggerimento? Traduci · exit status 1 /tmp/ccwbVu7e.o: In function main' /tmp/ccBHSL8j.o:9.1.c:(.text+0x0): first defined here collect2: error: ld returned 1 exit status 2012-07-16 · non trova la libreria dove è definita la funzione PlaySound. devi inserirla nell'include ... /usr/bin/ld: impossibile trovare -lc durante la compilazione con makefile Contesto di prima: ho una intestazione (event.h), un programma che si chiama evento.c, e il programma principale main.c. Questo programma verrà compilato, la generazione di un primo programma oggetto di un evento.o), quindi una … collect2: error: ld returned 1 exit status Il programma è questo: Codice: #include #include #define G 9.81 /* Questo programma calcola i valori dell'energia cinetica T = 1/2mv^2 e dell'energia potenziale U = mhg in funzione del tempo di un punto materiale di massa m soggetto a una gravità. A partire dalla versione 1.6, Subversion in ambiente linux (Debian nel mio caso) usa la libreria sqlite, suppongo per operazioni ai suoi database interni; chi come me preferisce scaricare sempre i sorgenti e compilarseli invece di scaricare i pacchetti sarà incappato in questo errore eseguendo il make: > /root/Desktop/subver sion-1.6.1/subversio n/libsvn_subr/.libs/ > libsvn_subr-1.so ... I'm doing a presentation on why technology is bad. I won't to focus more on the social aspect of it. Such as; how technology has isolated people, how it's made people less active, how it's made people more violent, and cyber-bullying. Traduci · EXO5 Piense en un número entre 1 y 15 y el equipo intenta encontrarlo. – Lenguaje Latino en Comentarios con indentación; EXO3 Introduzca un carácter y muéstrele si es una letra mayúscula o minúscula. – Lenguaje Latino en Comentarios con indentación; EXO4 Introduzca 3 enteros y muestre el mínimo de 3. Traduci · From: Ercan Pilicer Date: Mon, 29 Jul 2013 11:18:39 +0300 hi, please check your library path by locate command then add some variables ... Traduci · From: Yip, Kin Date: Wed, 24 Apr 2019 20:18:35 +0000 Hi, I try to build "fluka" (64 bit) in a machine of Scientific Linux 7.3 with kernel 3.10.0-693.11.6.el7.x86_64 . Its gcc is of version 4.8.5 . ld returned 1 exit status Qualcuno mi può dare una mano? @edit: dark shadow p.s tag e title! L-_LX_-Utente Silver. 3 Luglio 2008 83 0 67. 29 Agosto 2008 #2 RE: Problema con C++ quando compili la seconda volta hai ancora l'exe (debug) in esecuzione quindi non può sovrascriverlo. Chiudi il programma e ri-compila . R. Traduci · To prevent automated spam submissions leave this field empty. Navegación. Entradas de Bitácora; Normas de la comunidad; Preguntas frecuentes (FAQ) PyQt e cx_freeze - PyQT - ForumPython.it # il forum di riferimento per gli appassionati italiani di Python Traduci · We use cookies and other tracking technologies to improve your browsing experience on our website, to show you personalized content and targeted ads, to analyze our website traffic, and to understand where our visitors are coming from. Traduci · Install failed for plugin (name: Microsoft. i change hibernate. DefaultExecutor. 1 with Swift 2. The server is flawed. For the bash shell's purposes, a command which exits with a zero (0) exit status has succeeded. EnterpriseCloud. I havent figured out what yo write in the console to get the exit codes. Errorlevel and Exit codes. 73 Comments. Traduci · Code Blocks è una scelta eccellente per tutti colori che abitualmente programmano in C++. Si tratta di un ambiente di sviluppo integrato (dal codice sorgente libero e multi-piattaforma) che supporta l'utilizzo di più compilatori, come ad esempio: GCC (MinGW / GNU GCC), MSVC++, Digital Mars, Borland C++ 5.5 e Open Watcom. Traduci · The first thing that I have to say, after more than 10 years working with different OSes, is that there is no better operative system than Linux. Traduci · Ruben_Hoebee 2017-12-04 15:38:48 UTC #1 Hey I’m trying to control the Core2 board with a joystisck connected to ros and sending a twist message. However when I try to build my code I get the following errors: Domanda - [RISOLTO] Problema compilatore - no space left ...Time problems - Help - Husarion CommunityForum errore compilazione Dev C++ | Archivio del ... - HTML.itMixing static and dynamic linking | LABS Traduci · From: Jonathan Le Gouestre Date: Sun, 28 Jul 2013 22:57:21 +0200 Dear users, I contact you because i m a begineer and i want to install Fluka on my Ubuntu 12.10, and i got a problem during the Fluka's installation.

Leave a Comment:
Andry
19:06:54 **** Incremental Build of configuration Debug for project CMingw64bandwidthnvcc **** Info: Internal Builder is used for build "C:\\Program" "Files\\NVIDIA ...
Saha
Puoi verificare se è effettivamente collegato a: esegui make VERBOSE=1dalla riga di comando, dove Makefilesi trova il tuo progetto (possibilmente cambia un file sorgente per forzare la compilazione). Quindi, cercare la ldriga di comando nell'output di generazione. — Matematicamente.it • [C++] Prima volta compilazione con ...
Marikson
Ogni volta che implemento una funzione, e poi compilo, mi dà l'errore [Error]: Id Returned 1 exit status. Prima facevo solo dei programmi con il main, non funzioni, per cui quando mi presentava questo errore era perchè avevo lasciato l'exe aperto, quindi mi bastava chiuderlo. 2012-12-01 · [C]Funzione inline errore collect2: ld returned 1 exit status, Forum Programmazione: commenti, esempi e tutorial dalla community di HTML.it. problema di compilazione:collect2: ld returned 1 exit status
Search
Re: /usr/bin/ld: cannot find -lgcc_s from Ercan Pilicer on ...